Target
Coagulation factor X
Ligand
BDBM50114445
Substrate
Meas. Tech.
ChEBML_49164
IC50
3510±n/a nM
Citation
 Jia, ZJWu, YHuang, WGoldman, EZhang, PWoolfrey, JWong, PHuang, BSinha, UPark, GReed, AScarborough, RMZhu, BY Design, synthesis and biological activity of novel non-amidine factor Xa inhibitors. Part 1: P(1) structure-activity relationships of the substituted 1-(2-Naphthyl)-1H-pyrazole-5-carboxylamides. Bioorg Med Chem Lett 12:1651-5 (2002)  
Target
Name:
Coagulation factor X
Synonyms:
Activated coagulation factor X (FXa) Coagulation factor X precursor F10 Factor X heavy chain Factor Xa Stuart-Prower factor
Type:
Enzyme
Mol. Mass.:
54726.60
Organism:
Homo sapiens (Human)
Description:
Residue:
488
  
Inhibitor
Name:
BDBM50114445
Synonyms:
2-(6-Hydroxy-naphthalen-2-yl)-5-methyl-2H-pyrazole-3-carboxylic acid (2'-sulfamoyl-biphenyl-4-yl)-amide | CHEMBL44753
Type:
Small organic molecule
Emp. Form.:
C27H22N4O4S
Mol. Mass.:
498.553
SMILES:
Cc1cc(C(=O)Nc2ccc(cc2)-c2ccccc2S(N)(=O)=O)n(n1)-c1ccc2cc(O)ccc2c1
: