Target
Plasminogen
Ligand
BDBM50114443
Substrate
Meas. Tech.
ChEMBL_207871 (CHEMBL808449)
IC50
>11000±n/a nM
Citation
 Jia, ZJWu, YHuang, WGoldman, EZhang, PWoolfrey, JWong, PHuang, BSinha, UPark, GReed, AScarborough, RMZhu, BY Design, synthesis and biological activity of novel non-amidine factor Xa inhibitors. Part 1: P(1) structure-activity relationships of the substituted 1-(2-Naphthyl)-1H-pyrazole-5-carboxylamides. Bioorg Med Chem Lett 12:1651-5 (2002)  
Target
Name:
Plasminogen
Synonyms:
Activation peptide PLG Plasmin Plasmin heavy chain A, short form | Plasmin light chain B
Type:
Enzyme
Mol. Mass.:
90579.18
Organism:
Homo sapiens (Human)
Description:
Residue:
810
  
Inhibitor
Name:
BDBM50114443
Synonyms:
5-Methyl-2-(3-sulfamoyl-naphthalen-2-yl)-2H-pyrazole-3-carboxylic acid (2'-sulfamoyl-biphenyl-4-yl)-amide | CHEMBL295034
Type:
Small organic molecule
Emp. Form.:
C27H23N5O5S2
Mol. Mass.:
561.632
SMILES:
Cc1cc(C(=O)Nc2ccc(cc2)-c2ccccc2S(N)(=O)=O)n(n1)-c1cc2ccccc2cc1S(N)(=O)=O
: