Target
Coagulation factor X
Ligand
BDBM12597
Substrate
Meas. Tech.
ChEBML_49304
Ki
0.900000±n/a nM
Citation
 Czekaj, MKlein, SIGuertin, KRGardner, CJZulli, ALPauls, HWSpada, APCheney, DLBrown, KDColussi, DJChu, VLeadley, RJDunwiddie, CT Optimization of the beta-aminoester class of factor Xa inhibitors. Part 1: P(4) and side-chain modifications for improved in vitro potency. Bioorg Med Chem Lett 12:1667-70 (2002)  
Target
Name:
Coagulation factor X
Synonyms:
Activated coagulation factor X (FXa) Coagulation factor X precursor F10 Factor X heavy chain Factor Xa Stuart-Prower factor
Type:
Enzyme
Mol. Mass.:
54726.60
Organism:
Homo sapiens (Human)
Description:
Residue:
488
  
Inhibitor
Name:
BDBM12597
Synonyms:
CHEMBL48046 methyl (2R,3R)-2-{3-[amino(imino)methyl]benzyl}-3-({[3-(aminomethyl)-1,1-biphenyl-4-yl]carbonyl}amino)butanoate | methyl (2R,3R)-3-({4-[3-(aminomethyl)phenyl]phenyl}formamido)-2-[(3-carbamimidoylphenyl)methyl]butanoate
Type:
Small organic molecule
Emp. Form.:
C27H30N4O3
Mol. Mass.:
458.5521
SMILES:
COC(=O)[C@H](Cc1cccc(c1)C(N)=N)[C@@H](C)NC(=O)c1ccc(cc1)-c1cccc(CN)c1
: