Target
Serine protease 1
Ligand
BDBM50114542
Substrate
Meas. Tech.
ChEBML_212859
Ki
168±n/a nM
Citation
 Guertin, KRGardner, CJKlein, SIZulli, ALCzekaj, MGong, YSpada, APCheney, DLMaignan, SGuilloteau, JPBrown, KDColussi, DJChu, VHeran, CLMorgan, SRBentley, RGDunwiddie, CTLeadley, RJPauls, HW Optimization of the beta-aminoester class of factor Xa inhibitors. Part 2: Identification of FXV673 as a potent and selective inhibitor with excellent In vivo anticoagulant activity. Bioorg Med Chem Lett 12:1671-4 (2002)  
Target
Name:
Serine protease 1
Synonyms:
Alpha-trypsin chain 1 Beta-trypsin PRSS1 TRP1 TRY1_HUMAN Thrombin & trypsin Trypsin I | Trypsin-1
Type:
Enzyme
Mol. Mass.:
26557.80
Organism:
Homo sapiens (Human)
Description:
P07477
Residue:
247
  
Inhibitor
Name:
BDBM50114542
Synonyms:
4-{4-[(1R,2R)-3-(3-Carbamimidoyl-phenyl)-2-methoxycarbonyl-1-methyl-propylcarbamoyl]-phenyl}-1-methyl-pyridinium | CHEMBL47207
Type:
Small organic molecule
Emp. Form.:
C26H29N4O3
Mol. Mass.:
445.5329
SMILES:
COC(=O)[C@H](Cc1cccc(c1)C(N)=N)[C@@H](C)NC(=O)c1ccc(cc1)-c1cc[n+](C)cc1
: