Target
Melatonin receptor type 1B
Ligand
BDBM50114703
Substrate
Meas. Tech.
ChEMBL_105250 (CHEMBL710586)
EC50
0.096±n/a nM
Citation
 Wallez, VDurieux-Poissonnier, SChavatte, PBoutin, JAAudinot, VNicolas, JPBennejean, CDelagrange, PRenard, PLesieur, D Synthesis and structure-affinity-activity relationships of novel benzofuran derivatives as MT(2) melatonin receptor selective ligands. J Med Chem 45:2788-800 (2002)  
Target
Name:
Melatonin receptor type 1B
Synonyms:
MTNR1B Mel-1B-R Melatonin 1B Melatonin receptor type 1B | Melatonin receptor type 2 (MT2)
Type:
Enzyme
Mol. Mass.:
40203.54
Organism:
Homo sapiens (Human)
Description:
P49286
Residue:
362
  
Inhibitor
Name:
BDBM50114703
Synonyms:
CHEMBL287560 | N-[2-(5-Methoxy-2-phenyl-benzofuran-3-yl)-ethyl]-acetamide
Type:
Small organic molecule
Emp. Form.:
C19H19NO3
Mol. Mass.:
309.3591
SMILES:
COc1ccc2oc(c(CCNC(C)=O)c2c1)-c1ccccc1
: