Target
Melatonin receptor type 1A
Ligand
BDBM50114703
Substrate
Meas. Tech.
ChEMBL_105081 (CHEMBL711326)
EC50
0.17±n/a nM
Citation
 Wallez, VDurieux-Poissonnier, SChavatte, PBoutin, JAAudinot, VNicolas, JPBennejean, CDelagrange, PRenard, PLesieur, D Synthesis and structure-affinity-activity relationships of novel benzofuran derivatives as MT(2) melatonin receptor selective ligands. J Med Chem 45:2788-800 (2002)  
Target
Name:
Melatonin receptor type 1A
Synonyms:
MTNR1A MTR1A_HUMAN Mel1a melatonin receptor Melatonin receptor Melatonin receptor type 1 (MT1) | Melatonin receptor type 1A
Type:
Enzyme
Mol. Mass.:
39392.94
Organism:
Homo sapiens (Human)
Description:
P48039
Residue:
350
  
Inhibitor
Name:
BDBM50114703
Synonyms:
CHEMBL287560 | N-[2-(5-Methoxy-2-phenyl-benzofuran-3-yl)-ethyl]-acetamide
Type:
Small organic molecule
Emp. Form.:
C19H19NO3
Mol. Mass.:
309.3591
SMILES:
COc1ccc2oc(c(CCNC(C)=O)c2c1)-c1ccccc1
: