Target
Focal adhesion kinase 1
Ligand
BDBM50334594
Substrate
Meas. Tech.
ChEMBL_2049847 (CHEMBL4704546)
IC50
5.4±n/a nM
Citation
 Li, BLi, YTomkiewicz-Raulet, CDao, PLietha, DYen-Pon, EDu, ZCoumoul, XGarbay, CEtheve-Quelquejeu, MChen, H Design, Synthesis, and Biological Evaluation of Covalent Inhibitors of Focal Adhesion Kinase (FAK) against Human Malignant Glioblastoma. J Med Chem 63:12707-12724 (2020)  
Target
Name:
Focal adhesion kinase 1
Synonyms:
FADK 1 FAK1 FLT4 Focal adhesion kinase (FAK) Focal adhesion kinase 1 (FAK) Focal adhesion kinase-related nonkinase PTK2 Protein-tyrosine kinase 2 p125FAK | pp125FAK
Type:
Tyrosine-protein kinase
Mol. Mass.:
119233.17
Organism:
Homo sapiens (Human)
Description:
Q05397
Residue:
1052
  
Inhibitor
Name:
BDBM50334594
Synonyms:
2-(5-chloro-2-(2-methoxy-4-morpholinophenylamino)pyrimidin-4-ylamino)-N-methylbenzamide 2-[5-chloro-2-[2-methoxy-4-(4-morpholinyl)phenylamino]pyrimidin-4-ylamino]-N-methylbenzamide TAE226 US10774092, Example 12
Type:
Small organic molecule
Emp. Form.:
C23H25ClN6O3
Mol. Mass.:
468.936
SMILES:
CNC(=O)c1ccccc1Nc1nc(Nc2ccc(cc2OC)N2CCOCC2)ncc1Cl
: