Target
Nitric oxide synthase, brain
Ligand
BDBM50115127
Substrate
Meas. Tech.
ChEMBL_143354 (CHEMBL751278)
IC50
94000±n/a nM
Citation
 Matter, HKotsonis, PKlingler, OStrobel, HFröhlich, LGFrey, APfleiderer, WSchmidt, HH Structural requirements for inhibition of the neuronal nitric oxide synthase (NOS-I): 3D-QSAR analysis of 4-oxo- and 4-amino-pteridine-based inhibitors. J Med Chem 45:2923-41 (2002)  
Target
Name:
Nitric oxide synthase, brain
Synonyms:
Constitutive NOS NC-NOS NOS type I nNOS NOS1_HUMAN Neuronal nitric oxide synthase Nitric oxide synthase, neuronal (nNOS) bNOS | nNOS
Type:
Homodimer
Mol. Mass.:
160985.98
Organism:
Homo sapiens (Human)
Description:
P29475
Residue:
1434
  
Inhibitor
Name:
BDBM50115127
Synonyms:
CHEMBL101598 | N-(4-Isobutyrylamino-6,7-diphenyl-pteridin-2-yl)-isobutyramide
Type:
Small organic molecule
Emp. Form.:
C26H26N6O2
Mol. Mass.:
454.5236
SMILES:
CC(C)C(=O)Nc1nc(NC(=O)C(C)C)c2nc(-c3ccccc3)c(nc2n1)-c1ccccc1
: