Target
Nitric oxide synthase, brain
Ligand
BDBM50115154
Substrate
Meas. Tech.
ChEMBL_143354 (CHEMBL751278)
IC50
8000±n/a nM
Citation
 Matter, HKotsonis, PKlingler, OStrobel, HFröhlich, LGFrey, APfleiderer, WSchmidt, HH Structural requirements for inhibition of the neuronal nitric oxide synthase (NOS-I): 3D-QSAR analysis of 4-oxo- and 4-amino-pteridine-based inhibitors. J Med Chem 45:2923-41 (2002)  
Target
Name:
Nitric oxide synthase, brain
Synonyms:
Constitutive NOS NC-NOS NOS type I nNOS NOS1_HUMAN Neuronal nitric oxide synthase Nitric oxide synthase, neuronal (nNOS) bNOS | nNOS
Type:
Homodimer
Mol. Mass.:
160985.98
Organism:
Homo sapiens (Human)
Description:
P29475
Residue:
1434
  
Inhibitor
Name:
BDBM50115154
Synonyms:
2-Amino-6-(4-fluoro-phenyl)-3H-pteridin-4-one | CHEMBL98102
Type:
Small organic molecule
Emp. Form.:
C12H8FN5O
Mol. Mass.:
257.2232
SMILES:
Nc1nc2ncc(nc2c(=O)[nH]1)-c1ccc(F)cc1
: