Target
Nitric oxide synthase, brain
Ligand
BDBM50081586
Substrate
Meas. Tech.
ChEMBL_143354 (CHEMBL751278)
IC50
30000±n/a nM
Citation
 Matter, HKotsonis, PKlingler, OStrobel, HFröhlich, LGFrey, APfleiderer, WSchmidt, HH Structural requirements for inhibition of the neuronal nitric oxide synthase (NOS-I): 3D-QSAR analysis of 4-oxo- and 4-amino-pteridine-based inhibitors. J Med Chem 45:2923-41 (2002)  
Target
Name:
Nitric oxide synthase, brain
Synonyms:
Constitutive NOS NC-NOS NOS type I nNOS NOS1_HUMAN Neuronal nitric oxide synthase Nitric oxide synthase, neuronal (nNOS) bNOS | nNOS
Type:
Homodimer
Mol. Mass.:
160985.98
Organism:
Homo sapiens (Human)
Description:
P29475
Residue:
1434
  
Inhibitor
Name:
BDBM50081586
Synonyms:
6-Phenyl-4-piperidin-1-yl-pteridin-2-ylamine | CHEMBL101450
Type:
Small organic molecule
Emp. Form.:
C17H18N6
Mol. Mass.:
306.365
SMILES:
Nc1nc(N2CCCCC2)c2nc(cnc2n1)-c1ccccc1
: