Target
Nitric oxide synthase, brain
Ligand
BDBM50115166
Substrate
Meas. Tech.
ChEMBL_143354 (CHEMBL751278)
IC50
180000±n/a nM
Citation
 Matter, HKotsonis, PKlingler, OStrobel, HFröhlich, LGFrey, APfleiderer, WSchmidt, HH Structural requirements for inhibition of the neuronal nitric oxide synthase (NOS-I): 3D-QSAR analysis of 4-oxo- and 4-amino-pteridine-based inhibitors. J Med Chem 45:2923-41 (2002)  
Target
Name:
Nitric oxide synthase, brain
Synonyms:
Constitutive NOS NC-NOS NOS type I nNOS NOS1_HUMAN Neuronal nitric oxide synthase Nitric oxide synthase, neuronal (nNOS) bNOS | nNOS
Type:
Homodimer
Mol. Mass.:
160985.98
Organism:
Homo sapiens (Human)
Description:
P29475
Residue:
1434
  
Inhibitor
Name:
BDBM50115166
Synonyms:
2-Benzyloxycarbonylamino-3-phenyl-propionic acid 2,4-diamino-pteridin-6-ylmethyl ester | CHEMBL101620
Type:
Small organic molecule
Emp. Form.:
C24H23N7O4
Mol. Mass.:
473.4839
SMILES:
Nc1nc(N)c2nc(COC(=O)C(Cc3ccccc3)NC(=O)OCc3ccccc3)cnc2n1
: