Target
Phenylethanolamine N-methyltransferase
Ligand
BDBM50554689
Substrate
Meas. Tech.
ChEMBL_2050315 (CHEMBL4705014)
Ki
3.9±n/a nM
Citation
 Lu, JBart, AGWu, QCriscione, KRMcLeish, MJScott, EEGrunewald, GL Structure-Based Drug Design of Bisubstrate Inhibitors of Phenylethanolamine  J Med Chem 63:13878-13898 (2020)  
Target
Name:
Phenylethanolamine N-methyltransferase
Synonyms:
Noradrenaline N-methyltransferase PNMT PNMTase | Phenylethanolamine N-Methyltransferase (PNMT)
Type:
Enzyme
Mol. Mass.:
30852.66
Organism:
Homo sapiens (Human)
Description:
Residue:
282
  
Inhibitor
Name:
BDBM50554689
Synonyms:
CHEMBL4754656
Type:
Small organic molecule
Emp. Form.:
C24H33N7O3S
Mol. Mass.:
499.629
SMILES:
Nc1ncnc2n(cnc12)[C@@H]1O[C@H](CSCCCCNCC2Cc3ccccc3CN2)[C@@H](O)[C@H]1O
: