Target
C-C chemokine receptor type 5
Ligand
BDBM50115549
Substrate
Meas. Tech.
ChEMBL_49996 (CHEMBL661336)
Ki
3.8±n/a nM
Citation
 Palani, AShapiro, SJosien, HBara, TClader, JWGreenlee, WJCox, KStrizki, JMBaroudy, BM Synthesis, SAR, and biological evaluation of oximino-piperidino-piperidine amides. 1. Orally bioavailable CCR5 receptor antagonists with potent anti-HIV activity. J Med Chem 45:3143-60 (2002)  
Target
Name:
C-C chemokine receptor type 5
Synonyms:
C-C CKR-5 CCR-5 CD_antigen=CD195 Cmkbr5 | MIP-1 alpha receptor
Type:
PROTEIN
Mol. Mass.:
40803.93
Organism:
Mus musculus
Description:
ChEMBL_49996
Residue:
354
  
Inhibitor
Name:
BDBM50115549
Synonyms:
(2,4-Dimethyl-1-oxy-pyridin-3-yl)-{4-[ethoxyimino-(4-trifluoromethyl-phenyl)-methyl]-4'-methyl-[1,4']bipiperidinyl-1'-yl}-methanone CHEMBL261950
Type:
Small organic molecule
Emp. Form.:
C29H37F3N4O3
Mol. Mass.:
546.6243
SMILES:
CCO[N-][C+](C1CCN(CC1)C1(C)CCN(CC1)C(=O)c1c(C)cc[n+]([O-])c1C)c1ccc(cc1)C(F)(F)F
: