Target
C-C chemokine receptor type 5
Ligand
BDBM50115529
Substrate
Meas. Tech.
ChEMBL_49996 (CHEMBL661336)
Ki
9±n/a nM
Citation
 Palani, AShapiro, SJosien, HBara, TClader, JWGreenlee, WJCox, KStrizki, JMBaroudy, BM Synthesis, SAR, and biological evaluation of oximino-piperidino-piperidine amides. 1. Orally bioavailable CCR5 receptor antagonists with potent anti-HIV activity. J Med Chem 45:3143-60 (2002)  
Target
Name:
C-C chemokine receptor type 5
Synonyms:
C-C CKR-5 CCR-5 CD_antigen=CD195 Cmkbr5 | MIP-1 alpha receptor
Type:
PROTEIN
Mol. Mass.:
40803.93
Organism:
Mus musculus
Description:
ChEMBL_49996
Residue:
354
  
Inhibitor
Name:
BDBM50115529
Synonyms:
CHEMBL418997 | {4-[(4-Bromo-phenyl)-tert-butoxyimino-methyl]-4'-methyl-[1,4']bipiperidinyl-1'-yl}-(2,6-dimethyl-phenyl)-methanone
Type:
Small organic molecule
Emp. Form.:
C31H42BrN3O2
Mol. Mass.:
568.588
SMILES:
Cc1cccc(C)c1C(=O)N1CCC(C)(CC1)N1CCC(CC1)C(=N\OC(C)(C)C)\c1ccc(Br)cc1
: