Target
C-C chemokine receptor type 5
Ligand
BDBM50115544
Substrate
Meas. Tech.
ChEMBL_49996 (CHEMBL661336)
Ki
86±n/a nM
Citation
 Palani, AShapiro, SJosien, HBara, TClader, JWGreenlee, WJCox, KStrizki, JMBaroudy, BM Synthesis, SAR, and biological evaluation of oximino-piperidino-piperidine amides. 1. Orally bioavailable CCR5 receptor antagonists with potent anti-HIV activity. J Med Chem 45:3143-60 (2002)  
Target
Name:
C-C chemokine receptor type 5
Synonyms:
C-C CKR-5 CCR-5 CD_antigen=CD195 Cmkbr5 | MIP-1 alpha receptor
Type:
PROTEIN
Mol. Mass.:
40803.93
Organism:
Mus musculus
Description:
ChEMBL_49996
Residue:
354
  
Inhibitor
Name:
BDBM50115544
Synonyms:
(2,6-Dimethyl-phenyl)-[4'-methyl-4-(4-methylsulfanyl-benzyl)-[1,4']bipiperidinyl-1'-yl]-methanone | CHEMBL110463
Type:
Small organic molecule
Emp. Form.:
C28H38N2OS
Mol. Mass.:
450.679
SMILES:
CSc1ccc(CC2CCN(CC2)C2(C)CCN(CC2)C(=O)c2c(C)cccc2C)cc1
: