Target
Thyroid hormone receptor alpha
Ligand
BDBM50115668
Substrate
Meas. Tech.
ChEMBL_210491 (CHEMBL814598)
Kd
1.8±n/a nM
Citation
 Nguyen, NHApriletti, JWCunha Lima, STWebb, PBaxter, JDScanlan, TS Rational design and synthesis of a novel thyroid hormone antagonist that blocks coactivator recruitment. J Med Chem 45:3310-20 (2002)  
Target
Name:
Thyroid hormone receptor alpha
Synonyms:
C-erbA-alpha EAR7 NR1A1 THA_HUMAN THRA1 Thyroid Hormone Receptor (TR-alpha) Thyroid hormone receptor alpha c-erbA-1
Type:
Receptor
Mol. Mass.:
54818.00
Organism:
Homo sapiens (Human)
Description:
Recombinant hThR was obtained from nuclear extracts from SF9 cells infected with baculovirus vectors encoding for ThRalpha 1.
Residue:
490
  
Inhibitor
Name:
BDBM50115668
Synonyms:
3,5-dimethyl-4-(4'-hydroxy-3'-isopropylbenzyl)phenoxyacetic acid GC-1 US10544075, Compound GC-1 [4-(4-Hydroxy-3-isopropyl-benzyl)-3,5-dimethyl-phenoxy]-acetic acid(GC-1) | {4-[4-hydroxy-3-(1-methylethyl)benzyl]-3,5-dimethylphenoxy}acetic acid
Type:
Small organic molecule
Emp. Form.:
C20H24O4
Mol. Mass.:
328.4022
SMILES:
CC(C)c1cc(Cc2c(C)cc(OCC(O)=O)cc2C)ccc1O
: