Target
Macrophage metalloelastase
Ligand
BDBM50555050
Substrate
Meas. Tech.
ChEMBL_2051204 (CHEMBL4705903)
Ki
1.000000±n/a nM
Citation
 Gona, KToczek, JYe, YSanzida, NGolbazi, ABoodagh, PSalarian, MJung, JJRajendran, SKukreja, GWu, TLDevel, LSadeghi, MM Hydroxamate-Based Selective Macrophage Elastase (MMP-12) Inhibitors and Radiotracers for Molecular Imaging. J Med Chem 63:15037-15049 (2020)  
Target
Name:
Macrophage metalloelastase
Synonyms:
HME MMP12_HUMAN Matrix metalloproteinase-12 (MMP 12) Matrix metalloproteinase-12 (MMP12) | Matrix metalloproteinases 12 (MMP-12)
Type:
Enzyme
Mol. Mass.:
54012.99
Organism:
Homo sapiens (Human)
Description:
P39900
Residue:
470
  
Inhibitor
Name:
BDBM50555050
Synonyms:
CHEMBL4764575
Type:
Small organic molecule
Emp. Form.:
C27H43N7O6
Mol. Mass.:
561.6736
SMILES:
CNC(=O)[C@H](CCCNC(N)=N)NC(=O)[C@@H]1Cc2ccc(OCCC[C@@H]([C@@H](CC(C)C)C(=O)N1)C(=O)NO)cc2
: