Target
Tissue-type plasminogen activator
Ligand
BDBM50115871
Substrate
Meas. Tech.
ChEBML_208242
Ki
44000±n/a nM
Citation
 Mackman, RLHui, HCBreitenbucher, JGKatz, BALuong, CMartelli, AMcGee, DRadika, KSendzik, MSpencer, JRSprengeler, PATario, JVerner, EWang, J 2-(2-Hydroxy-3-alkoxyphenyl)-1H-benzimidazole-5-carboxamidine derivatives as potent and selective urokinase-type plasminogen activator inhibitors. Bioorg Med Chem Lett 12:2019-22 (2002)  
Target
Name:
Tissue-type plasminogen activator
Synonyms:
Alteplase Reteplase Thrombin receptor protein Tissue-type plasminogen activator (tPA) t-PA t-plasminogen activator
Type:
Enzyme
Mol. Mass.:
62931.08
Organism:
Homo sapiens (Human)
Description:
Residue:
562
  
Inhibitor
Name:
BDBM50115871
Synonyms:
6-Fluoro-2-[2-hydroxy-3-((S)-2-methyl-cyclopentyloxy)-phenyl]-1H-benzoimidazole-5-carboxamidine | CHEMBL416674
Type:
Small organic molecule
Emp. Form.:
C20H21FN4O2
Mol. Mass.:
368.4047
SMILES:
C[C@H]1CCC[C@@H]1Oc1cccc(-c2nc3cc(F)c(cc3[nH]2)C(N)=N)c1O
: