Target
Tissue-type plasminogen activator
Ligand
BDBM50115897
Substrate
Meas. Tech.
ChEBML_208244
Ki
>95000±n/a nM
Citation
 Spencer, JRMcGee, DAllen, DKatz, BALuong, CSendzik, MSquires, NMackman, RL 4-Aminoarylguanidine and 4-aminobenzamidine derivatives as potent and selective urokinase-type plasminogen activator inhibitors. Bioorg Med Chem Lett 12:2023-6 (2002)  
Target
Name:
Tissue-type plasminogen activator
Synonyms:
Alteplase Reteplase Thrombin receptor protein Tissue-type plasminogen activator (tPA) t-PA t-plasminogen activator
Type:
Enzyme
Mol. Mass.:
62931.08
Organism:
Homo sapiens (Human)
Description:
Residue:
562
  
Inhibitor
Name:
BDBM50115897
Synonyms:
CHEMBL64841 | N-(4-Guanidino-phenyl)-2-hydroxy-5-methyl-benzamide
Type:
Small organic molecule
Emp. Form.:
C15H16N4O2
Mol. Mass.:
284.3131
SMILES:
Cc1ccc(O)c(c1)C(=O)Nc1ccc(cc1)N=C(N)N
: