Target
Tissue-type plasminogen activator
Ligand
BDBM14157
Substrate
Meas. Tech.
ChEBML_208244
Ki
240±n/a nM
Citation
 Spencer, JRMcGee, DAllen, DKatz, BALuong, CSendzik, MSquires, NMackman, RL 4-Aminoarylguanidine and 4-aminobenzamidine derivatives as potent and selective urokinase-type plasminogen activator inhibitors. Bioorg Med Chem Lett 12:2023-6 (2002)  
Target
Name:
Tissue-type plasminogen activator
Synonyms:
Alteplase Reteplase Thrombin receptor protein Tissue-type plasminogen activator (tPA) t-PA t-plasminogen activator
Type:
Enzyme
Mol. Mass.:
62931.08
Organism:
Homo sapiens (Human)
Description:
Residue:
562
  
Inhibitor
Name:
BDBM14157
Synonyms:
APC-10605 N-(4-carbamimidoylphenyl)-2-hydroxy-3-iodo-5-methylbenzamide
Type:
Small organic molecule
Emp. Form.:
C15H14IN3O2
Mol. Mass.:
395.195
SMILES:
Cc1cc(I)c(O)c(c1)C(=O)Nc1ccc(cc1)C(N)=N
: