Target
Cytochrome P450 2D6
Ligand
BDBM50121975
Substrate
Meas. Tech.
ChEMBL_2052440 (CHEMBL4707441)
IC50
8.1±n/a nM
Citation
 Sniecikowska, JGluch-Lutwin, MBucki, AWi?ckowska, ASiwek, AJastrzebska-Wiesek, MPartyka, AWilczy?ska, DPytka, KPociecha, KCios, AWyska, EWeso?owska, APaw?owski, MVarney, MANewman-Tancredi, AKolaczkowski, M Novel Aryloxyethyl Derivatives of 1-(1-Benzoylpiperidin-4-yl)methanamine as the Extracellular Regulated Kinases 1/2 (ERK1/2) Phosphorylation-Preferring Serotonin 5-HT J Med Chem 62:2750-2771 (2019)  
Target
Name:
Cytochrome P450 2D6
Synonyms:
CP2D6_HUMAN CYP2DL1 Cytochrome P450 2D6 (CYP2D6) P450-DB1
Type:
Protein
Mol. Mass.:
55774.82
Organism:
Homo sapiens (Human)
Description:
P10635
Residue:
497
  
Inhibitor
Name:
BDBM50121975
Synonyms:
(6-Methoxy-quinolin-4-yl)-(5-vinyl-1-aza-bicyclo[2.2.2]oct-2-yl)-methanol CHEMBL1294 DURAQUIN QUINAGLUTE QUINATIME QUINIDINE US9402878, Quinidine
Type:
Small organic molecule
Emp. Form.:
C20H24N2O2
Mol. Mass.:
324.4168
SMILES:
COc1ccc2nccc([C@H](O)[C@H]3C[C@@H]4CCN3C[C@@H]4C=C)c2c1
: