Target
Tyrosine-protein kinase Lck
Ligand
BDBM50116392
Substrate
Meas. Tech.
ChEMBL_221318 (CHEMBL841208)
IC50
>40000±n/a nM
Citation
 Snow, RJCardozo, MGMorwick, TMBusacca, CADong, YEckner, RJJacober, SJakes, SKapadia, SLukas, SPanzenbeck, MPeet, GWPeterson, JDProkopowicz, ASSellati, RTolbert, RMTschantz, MAMoss, N Discovery of 2-phenylamino-imidazo[4,5-h]isoquinolin-9-ones: a new class of inhibitors of lck kinase. J Med Chem 45:3394-405 (2002)  
Target
Name:
Tyrosine-protein kinase Lck
Synonyms:
2.7.10.2 LCK_HUMAN Leukocyte C-terminal Src kinase Lymphocyte-specific protein tyrosine kinase Protein YT16 Proto-oncogene tyrosine-protein kinase LCK T cell-specific protein-tyrosine kinase
Type:
Mol. Mass.:
57987.83
Organism:
Homo sapiens (Human)
Description:
P06239
Residue:
509
  
Inhibitor
Name:
BDBM50116392
Synonyms:
(2,6-Dichloro-phenyl)-(6,6-dimethyl-6,7,8,9-tetrahydro-1H-imidazo[4,5-h]isoquinolin-2-yl)-amine | CHEMBL326155
Type:
Small organic molecule
Emp. Form.:
C18H18Cl2N4
Mol. Mass.:
361.268
SMILES:
CC1(C)CNCc2c1ccc1nc(Nc3c(Cl)cccc3Cl)[nH]c21
: