Target
Tyrosine-protein kinase Lck
Ligand
BDBM50116408
Substrate
Meas. Tech.
ChEMBL_221318 (CHEMBL841208)
IC50
150±n/a nM
Citation
 Snow, RJCardozo, MGMorwick, TMBusacca, CADong, YEckner, RJJacober, SJakes, SKapadia, SLukas, SPanzenbeck, MPeet, GWPeterson, JDProkopowicz, ASSellati, RTolbert, RMTschantz, MAMoss, N Discovery of 2-phenylamino-imidazo[4,5-h]isoquinolin-9-ones: a new class of inhibitors of lck kinase. J Med Chem 45:3394-405 (2002)  
Target
Name:
Tyrosine-protein kinase Lck
Synonyms:
2.7.10.2 LCK_HUMAN Leukocyte C-terminal Src kinase Lymphocyte-specific protein tyrosine kinase Protein YT16 Proto-oncogene tyrosine-protein kinase LCK T cell-specific protein-tyrosine kinase
Type:
Mol. Mass.:
57987.83
Organism:
Homo sapiens (Human)
Description:
P06239
Residue:
509
  
Inhibitor
Name:
BDBM50116408
Synonyms:
2-(2-Chloro-phenylamino)-6,7-dimethyl-1,8-dihydro-imidazo[4,5-h]isoquinolin-9-one | CHEMBL114318
Type:
Small organic molecule
Emp. Form.:
C18H15ClN4O
Mol. Mass.:
338.791
SMILES:
Cc1[nH]c(=O)c2c3nc(Nc4ccccc4Cl)[nH]c3ccc2c1C
: