Target
Nitric oxide synthase, inducible
Ligand
BDBM50116670
Substrate
Meas. Tech.
ChEBML_89186
IC50
170±n/a nM
Citation
 Kawanaka, YKobayashi, KKusuda, STatsumi, TMurota, MNishiyama, THisaichi, KFujii, AHirai, KNaka, MKomeno, MNakai, HToda, M Design and synthesis of orally bioavailable inhibitors of inducible nitric oxide synthase. Part 1: synthesis and biological evaluation of dihydropyridin-2-imines. Bioorg Med Chem Lett 12:2291-4 (2002)  
Target
Name:
Nitric oxide synthase, inducible
Synonyms:
HEP-NOS Inducible NO synthase NOS type II NOS2A Nitric oxide synthase, inducible (iNOS) | iNOS
Type:
Homodimer
Mol. Mass.:
131141.95
Organism:
Homo sapiens (Human)
Description:
P35228
Residue:
1153
  
Inhibitor
Name:
BDBM50116670
Synonyms:
(4aR,7aR)-4-Methyl-1,4a,5,6,7,7a-hexahydro-[1]pyrindin-(2E)-ylideneamine | CHEMBL75428
Type:
Small organic molecule
Emp. Form.:
C9H14N2
Mol. Mass.:
150.2209
SMILES:
CC1=CC(N)=N[C@@H]2CCC[C@H]12
: