Target
Nitric oxide synthase, inducible
Ligand
BDBM50116674
Substrate
Meas. Tech.
ChEBML_89359
IC50
25±n/a nM
Citation
 Kawanaka, YKobayashi, KKusuda, STatsumi, TMurota, MNishiyama, THisaichi, KFujii, AHirai, KNaka, MKomeno, MNakai, HToda, M Design and synthesis of orally bioavailable inhibitors of inducible nitric oxide synthase. Part 1: synthesis and biological evaluation of dihydropyridin-2-imines. Bioorg Med Chem Lett 12:2291-4 (2002)  
Target
Name:
Nitric oxide synthase, inducible
Synonyms:
Inducible NO synthase Inducible nitric oxide synthase (iNOS) MAC-NOS NOS type II Nitric Oxide Synthase, inducible Nos2
Type:
Enzyme
Mol. Mass.:
130595.79
Organism:
Mus musculus (mouse)
Description:
Recombinant enzyme overexpressed in E. coli.
Residue:
1144
  
Inhibitor
Name:
BDBM50116674
Synonyms:
6-Allyl-4-methyl-5,6-dihydro-1H-pyridin-(2Z)-ylideneamine | CHEMBL72316
Type:
Small organic molecule
Emp. Form.:
C9H14N2
Mol. Mass.:
150.2209
SMILES:
CC1=CC(N)=NC(CC=C)C1
: