Target
Beta-galactosidase
Ligand
BDBM50403936
Substrate
Meas. Tech.
ChEMBL_37116 (CHEMBL653448)
Ki
6600±n/a nM
Citation
 Moreno-Vargas, AJDemange, RFuentes, JRobina, IVogel, P Synthesis of [(2S,3S,4R)-3,4-dihydroxypyrrolidin-2-yl]-5-methylfuran-4-carboxylic acid derivatives: new leads as selective beta-galactosidase inhibitors. Bioorg Med Chem Lett 12:2335-9 (2002)  
Target
Name:
Beta-galactosidase
Synonyms:
Acid beta-galactosidase ELNR1 GLB1 | Lactase
Type:
PROTEIN
Mol. Mass.:
76074.43
Organism:
Homo sapiens (Human)
Description:
ChEMBL_215886
Residue:
677
  
Inhibitor
Name:
BDBM50403936
Synonyms:
CHEMBL2114148
Type:
Small organic molecule
Emp. Form.:
C12H17NO5
Mol. Mass.:
255.2671
SMILES:
CCOC(=O)c1cc(oc1C)[C@H]1NC[C@@H](O)[C@H]1O
: