Target
Retinoic acid receptor RXR-gamma
Ligand
BDBM31883
Substrate
Meas. Tech.
ChEBML_70528
Ki
1.4±n/a nM
Citation
 Walker, JRAlshafie, GAbou-Issa, HCurley, RW An improved synthesis of the C-linked glucuronide of N-(4-hydroxyphenyl)retinamide. Bioorg Med Chem Lett 12:2447-50 (2002)  
Target
Name:
Retinoic acid receptor RXR-gamma
Synonyms:
NR2B3 RXRG Retinoic acid receptor RXR-gamma Retinoid X receptor gamma/retinoic acid receptor alpha
Type:
PROTEIN
Mol. Mass.:
50878.26
Organism:
Homo sapiens (Human)
Description:
ChEMBL_197216
Residue:
463
  
Inhibitor
Name:
BDBM31883
Synonyms:
9-cis-retinoic acid (9cRA) AT-RA CHEMBL38 SMR000058245 Vitamin A acid [3H]Retinoic acid [3H]tretinoin cid_444795
Type:
radiolabeled ligand
Emp. Form.:
C20H28O2
Mol. Mass.:
300.4351
SMILES:
C\C(\C=C\C1=C(C)CCCC1(C)C)=C/C=C/C(/C)=C/C(O)=O
: