Target
5-hydroxytryptamine receptor 7
Ligand
BDBM50116967
Substrate
Meas. Tech.
ChEBML_3696
Ki
3±n/a nM
Citation
 Isaac, MBXin, TO'Brien, ASt-Martin, DNaismith, AMacLean, NWilson, JDemchyshyn, LTehim, ASlassi, A 1-(Bicyclopiperazinyl)ethylindoles and 1-(homopiperazinyl)ethyl-indoles as highly selective and potent 5-HT(7) receptor ligands. Bioorg Med Chem Lett 12:2451-4 (2002)  
Target
Name:
5-hydroxytryptamine receptor 7
Synonyms:
5-HT-7 5-HT7 5-HT7S 5HT7 HTR7 | Serotonin receptor 7
Type:
G Protein-Coupled Receptor (GPCR)
Mol. Mass.:
53573.08
Organism:
Homo sapiens (Human)
Description:
P34969
Residue:
479
  
Inhibitor
Name:
BDBM50116967
Synonyms:
2-[2-(6-Bromo-indol-1-yl)-ethyl]-decahydro-pyrido[1,2-a][1,4]diazepine | CHEMBL309750
Type:
Small organic molecule
Emp. Form.:
C19H26BrN3
Mol. Mass.:
376.334
SMILES:
Brc1ccc2ccn(CCN3CCCN4CCCCC4C3)c2c1
: