Target
5-hydroxytryptamine receptor 6
Ligand
BDBM50116967
Substrate
Meas. Tech.
ChEBML_3666
Ki
4066±n/a nM
Citation
 Isaac, MBXin, TO'Brien, ASt-Martin, DNaismith, AMacLean, NWilson, JDemchyshyn, LTehim, ASlassi, A 1-(Bicyclopiperazinyl)ethylindoles and 1-(homopiperazinyl)ethyl-indoles as highly selective and potent 5-HT(7) receptor ligands. Bioorg Med Chem Lett 12:2451-4 (2002)  
Target
Name:
5-hydroxytryptamine receptor 6
Synonyms:
5-HT-6 5-hydroxytryptamine receptor 6 (5-HT-6) 5-hydroxytryptamine receptor 6 (5HT6) HTR6 Serotonin 6 (5-HT6) receptor | Serotonin Receptor 6
Type:
G Protein-Coupled Receptor (GPCR)
Mol. Mass.:
46968.43
Organism:
Homo sapiens (Human)
Description:
P50406
Residue:
440
  
Inhibitor
Name:
BDBM50116967
Synonyms:
2-[2-(6-Bromo-indol-1-yl)-ethyl]-decahydro-pyrido[1,2-a][1,4]diazepine | CHEMBL309750
Type:
Small organic molecule
Emp. Form.:
C19H26BrN3
Mol. Mass.:
376.334
SMILES:
Brc1ccc2ccn(CCN3CCCN4CCCCC4C3)c2c1
: