Target
Adenosine kinase
Ligand
BDBM50117159
Substrate
Meas. Tech.
ChEMBL_31124 (CHEMBL643552)
IC50
106±n/a nM
Citation
 Gomtsyan, ADidomenico, SLee, CHMatulenko, MAKim, KKowaluk, EAWismer, CTMikusa, JYu, HKohlhaas, KJarvis, MFBhagwat, SS Design, synthesis, and structure-activity relationship of 6-alkynylpyrimidines as potent adenosine kinase inhibitors. J Med Chem 45:3639-48 (2002)  
Target
Name:
Adenosine kinase
Synonyms:
ADENOSINE Adenosine 5-phosphotransferase Adenosine kinase | Adk
Type:
Enzyme
Mol. Mass.:
40130.14
Organism:
Rattus norvegicus (rat)
Description:
Rat brain cytosol as enzyme source.
Residue:
361
  
Inhibitor
Name:
BDBM50117159
Synonyms:
CHEMBL121400 | N*5*-(4-Chloro-benzyl)-N*5*-methyl-6-(6-morpholin-4-yl-pyridin-3-ylethynyl)-pyrimidine-4,5-diamine
Type:
Small organic molecule
Emp. Form.:
C23H23ClN6O
Mol. Mass.:
434.921
SMILES:
CN(Cc1ccc(Cl)cc1)c1c(N)ncnc1C#Cc1ccc(nc1)N1CCOCC1
: