Target
Adenosine kinase
Ligand
BDBM50117170
Substrate
Meas. Tech.
ChEMBL_31124 (CHEMBL643552)
IC50
4.5±n/a nM
Citation
 Gomtsyan, ADidomenico, SLee, CHMatulenko, MAKim, KKowaluk, EAWismer, CTMikusa, JYu, HKohlhaas, KJarvis, MFBhagwat, SS Design, synthesis, and structure-activity relationship of 6-alkynylpyrimidines as potent adenosine kinase inhibitors. J Med Chem 45:3639-48 (2002)  
Target
Name:
Adenosine kinase
Synonyms:
ADENOSINE Adenosine 5-phosphotransferase Adenosine kinase | Adk
Type:
Enzyme
Mol. Mass.:
40130.14
Organism:
Rattus norvegicus (rat)
Description:
Rat brain cytosol as enzyme source.
Residue:
361
  
Inhibitor
Name:
BDBM50117170
Synonyms:
6-(6-Morpholin-4-yl-pyridin-3-ylethynyl)-5-phenethyl-pyrimidin-4-ylamine | CHEMBL121633
Type:
Small organic molecule
Emp. Form.:
C23H23N5O
Mol. Mass.:
385.4616
SMILES:
Nc1ncnc(C#Cc2ccc(nc2)N2CCOCC2)c1CCc1ccccc1
: