Target
Adenosine receptor A2a
Ligand
BDBM50117227
Substrate
Meas. Tech.
ChEMBL_31208 (CHEMBL640305)
IC50
56±n/a nM
Citation
 Okamura, TKurogi, YNishikawa, HHashimoto, KFujiwara, HNagao, Y 1,2,4-Triazolo[5,1-i]purine derivatives as highly potent and selective human adenosine A(3) receptor ligands. J Med Chem 45:3703-8 (2002)  
Target
Name:
Adenosine receptor A2a
Synonyms:
A2A adenosine receptor (hA2A) ADENOSINE A2 ADORA2 Adenosine A2A receptor (A2AAR)
Type:
G Protein-Coupled Receptor (GPCR)
Mol. Mass.:
44716.46
Organism:
Homo sapiens (Human)
Description:
P29274
Residue:
412
  
Inhibitor
Name:
BDBM50117227
Synonyms:
5-Butyl-8-(3-chloro-phenyl)-3H-[1,2,4]triazolo[5,1-i]purine | CHEMBL122667
Type:
Small organic molecule
Emp. Form.:
C16H15ClN6
Mol. Mass.:
326.784
SMILES:
CCCCc1nc2nc[nH]c2c2nc(nn12)-c1cccc(Cl)c1
: