Target
Substance-P receptor
Ligand
BDBM50117508
Substrate
Meas. Tech.
ChEMBL_205874 (CHEMBL810141)
Ki
400±n/a nM
Citation
 Seward, EMCarlson, EHarrison, THaworth, KRHerbert, RKelleher, FJKurtz, MMMoseley, JOwen, SNOwens, APSadowski, SJSwain, CJWilliams, BJ Spirocyclic NK(1) antagonists I: [4.5] and [5.5]-spiroketals. Bioorg Med Chem Lett 12:2515-8 (2002)  
Target
Name:
Substance-P receptor
Synonyms:
NK-1 receptor NK1 Receptor NK1R_HUMAN Neurokinin-1 (NK-1) SPR TACR1 Tachykinin receptor 1 (NK1) | tachykinin
Type:
G Protein-Coupled Receptor (GPCR)
Mol. Mass.:
46254.43
Organism:
Homo sapiens (Human)
Description:
P25103
Residue:
407
  
Inhibitor
Name:
BDBM50117508
Synonyms:
(5S,6R,9R)-5-(4-Fluoro-phenyl)-9-(2-trifluoromethyl-phenyl)-1,7-dioxa-4-aza-spiro[5.5]undecane CHEMBL311027
Type:
Small organic molecule
Emp. Form.:
C21H21F4NO2
Mol. Mass.:
395.3906
SMILES:
Fc1ccc(cc1)[C@@H]1NCCOC11CC[C@@H](CO1)c1ccccc1C(F)(F)F
: