Target
Nitric oxide synthase, endothelial
Ligand
BDBM50117551
Substrate
Meas. Tech.
ChEBML_65136
IC50
960.0±n/a nM
Citation
 Jaroch, SHölscher, PRehwinkel, HSülzle, DBurton, GHillmann, MMcDonald, FM Dihydroquinolines as novel n-NOS inhibitors. Bioorg Med Chem Lett 12:2561-4 (2002)  
Target
Name:
Nitric oxide synthase, endothelial
Synonyms:
Constitutive NOS Endothelial NOS NOS type III NOS3_HUMAN Nitric oxide synthase (inducible and endothelial) Nitric-oxide synthase (endothelial and brain) eNOS
Type:
Enzyme Catalytic Domain
Mol. Mass.:
133297.84
Organism:
Homo sapiens (Human)
Description:
P29474
Residue:
1203
  
Inhibitor
Name:
BDBM50117551
Synonyms:
1,3,3a,9b-Tetrahydro-furo[3,4-c]quinolin-4-ylamine | CHEMBL315966
Type:
Small organic molecule
Emp. Form.:
C11H12N2O
Mol. Mass.:
188.2258
SMILES:
NC1=Nc2ccccc2[C@H]2COC[C@@H]12
: