Target
Nitric oxide synthase, endothelial
Ligand
BDBM50117559
Substrate
Meas. Tech.
ChEBML_65136
IC50
2300±n/a nM
Citation
 Jaroch, SHölscher, PRehwinkel, HSülzle, DBurton, GHillmann, MMcDonald, FM Dihydroquinolines as novel n-NOS inhibitors. Bioorg Med Chem Lett 12:2561-4 (2002)  
Target
Name:
Nitric oxide synthase, endothelial
Synonyms:
Constitutive NOS Endothelial NOS NOS type III NOS3_HUMAN Nitric oxide synthase (inducible and endothelial) Nitric-oxide synthase (endothelial and brain) eNOS
Type:
Enzyme Catalytic Domain
Mol. Mass.:
133297.84
Organism:
Homo sapiens (Human)
Description:
P29474
Residue:
1203
  
Inhibitor
Name:
BDBM50117559
Synonyms:
8-Fluoro-2,3,3a,9b-tetrahydro-1H-cyclopenta[c]quinolin-4-ylamine | CHEMBL86040
Type:
Small organic molecule
Emp. Form.:
C12H13FN2
Mol. Mass.:
204.2434
SMILES:
NC1=Nc2ccc(F)cc2[C@H]2CCC[C@@H]12
: