Target
Nitric oxide synthase, brain
Ligand
BDBM50117559
Substrate
Meas. Tech.
ChEBML_143217
IC50
110±n/a nM
Citation
 Jaroch, SHölscher, PRehwinkel, HSülzle, DBurton, GHillmann, MMcDonald, FM Dihydroquinolines as novel n-NOS inhibitors. Bioorg Med Chem Lett 12:2561-4 (2002)  
Target
Name:
Nitric oxide synthase, brain
Synonyms:
Constitutive NOS NC-NOS NOS type I nNOS NOS1_HUMAN Neuronal nitric oxide synthase Nitric oxide synthase, neuronal (nNOS) bNOS | nNOS
Type:
Homodimer
Mol. Mass.:
160985.98
Organism:
Homo sapiens (Human)
Description:
P29475
Residue:
1434
  
Inhibitor
Name:
BDBM50117559
Synonyms:
8-Fluoro-2,3,3a,9b-tetrahydro-1H-cyclopenta[c]quinolin-4-ylamine | CHEMBL86040
Type:
Small organic molecule
Emp. Form.:
C12H13FN2
Mol. Mass.:
204.2434
SMILES:
NC1=Nc2ccc(F)cc2[C@H]2CCC[C@@H]12
: