Target
Platelet-activating factor acetylhydrolase
Ligand
BDBM50117801
Substrate
Meas. Tech.
ChEBML_156373
IC50
0.200000±n/a nM
Citation
 Blackie, JABloomer, JCBrown, MJCheng, HYElliott, RLHammond, BHickey, DMIfe, RJLeach, CALewis, VAMacphee, CHMilliner, KJMoores, KEPinto, ILSmith, SAStansfield, IGStanway, SJTaylor, MATheobald, CJWhittaker, CM The discovery of SB-435495. A potent, orally active inhibitor of lipoprotein-associated phospholipase A(2) for evaluation in man. Bioorg Med Chem Lett 12:2603-6 (2002)  
Target
Name:
Platelet-activating factor acetylhydrolase
Synonyms:
1-alkyl-2-acetylglycerophosphocholine esterase LDL-PLA(2) PAF 2-acylhydrolase PAFAH PLA2G7 | Platelet-activating factor acetylhydrolase
Type:
PROTEIN
Mol. Mass.:
50084.41
Organism:
Homo sapiens (Human)
Description:
ChEMBL_156212
Residue:
441
  
Inhibitor
Name:
BDBM50117801
Synonyms:
CHEMBL87787 | N-(4'-Chloro-biphenyl-4-ylmethyl)-2-[2-(4-fluoro-benzylsulfanyl)-5-(2-methoxy-pyrimidin-5-ylmethyl)-4-oxo-4H-pyrimidin-1-yl]-N-(2-hydroxy-ethyl)-acetamide
Type:
Small organic molecule
Emp. Form.:
C34H31ClFN5O4S
Mol. Mass.:
660.157
SMILES:
COc1ncc(Cc2cn(CC(=O)N(CCO)Cc3ccc(cc3)-c3ccc(Cl)cc3)c(SCc3ccc(F)cc3)nc2=O)cn1
: