Target
G-protein coupled receptor 84
Ligand
BDBM50147581
Substrate
Meas. Tech.
ChEMBL_2057168 (CHEMBL4712169)
EC50
14400±n/a nM
Citation
 Chen, LHZhang, QXie, XNan, FJ Modulation of the G-Protein-Coupled Receptor 84 (GPR84) by Agonists and Antagonists. J Med Chem 63:15399-15409 (2020)  
Target
Name:
G-protein coupled receptor 84
Synonyms:
EX33 GPR84 Inflammation-related G-protein coupled receptor EX33
Type:
PROTEIN
Mol. Mass.:
43726.73
Organism:
Homo sapiens (Human)
Description:
ChEMBL_116040
Residue:
396
  
Inhibitor
Name:
BDBM50147581
Synonyms:
1-tridecanecarboxylic acid CH3-[CH2]12-COOH Myristinsaeure myristic acid n-Tetradecoic acid tetradecoic acid
Type:
Small organic molecule
Emp. Form.:
C14H28O2
Mol. Mass.:
228.3709
SMILES:
CCCCCCCCCCCCCC(O)=O
: