Target
Endothelin-1 receptor
Ligand
BDBM50117911
Substrate
Meas. Tech.
ChEMBL_65647 (CHEMBL678559)
Ki
39±n/a nM
Citation
 Murugesan, NTellew, JEGu, ZKunst, BLFadnis, LCornelius, LABaska, RAYang, YBeyer, SMMonshizadegan, HDickinson, KEPanchal, BValentine, MTChong, SMorrison, RACarlson, KEPowell, JRMoreland, SBarrish, JCKowala, MCMacor, JE Discovery of N-isoxazolyl biphenylsulfonamides as potent dual angiotensin II and endothelin A receptor antagonists. J Med Chem 45:3829-35 (2002)  
Target
Name:
Endothelin-1 receptor
Synonyms:
EDNRA ET-A ETA-R Endothelin receptor type A hET-AR
Type:
Enzyme Catalytic Domain
Mol. Mass.:
48736.88
Organism:
Homo sapiens (Human)
Description:
P25101
Residue:
427
  
Inhibitor
Name:
BDBM50117911
Synonyms:
4'-(2-Butyl-4-oxo-1,3-diaza-spiro[4.4]non-1-en-3-ylmethyl)-biphenyl-2-sulfonic acid (3,4-dimethyl-isoxazol-5-yl)-amide | CHEMBL126755
Type:
Small organic molecule
Emp. Form.:
C29H34N4O4S
Mol. Mass.:
534.67
SMILES:
CCCCC1=NC2(CCCC2)C(=O)N1Cc1ccc(cc1)-c1ccccc1S(=O)(=O)Nc1onc(C)c1C
: