Target
5-hydroxytryptamine receptor 1A
Ligand
BDBM50118328
Substrate
Meas. Tech.
ChEMBL_1140 (CHEMBL616085)
Ki
5.5±n/a nM
Citation
 Orús, LPérez-Silanes, SOficialdegui, AMMartínez-Esparza, JDel Castillo, JCMourelle, MLanger, TGuccione, SDonzella, GKrovat, EMPoptodorov, KLasheras, BBallaz, SHervías, ITordera, RDel Río, JMonge, A Synthesis and molecular modeling of new 1-aryl-3-[4-arylpiperazin-1-yl]-1-propane derivatives with high affinity at the serotonin transporter and at 5-HT(1A) receptors. J Med Chem 45:4128-39 (2002)  
Target
Name:
5-hydroxytryptamine receptor 1A
Synonyms:
5-HT-1A 5-HT1A 5-hydroxytryptamine receptor 1A (5HT1A) 5ht1a Htr1a Serotonin 1a (5-HT1a) receptor/Adrenergic receptor alpha-1 | Serotonin receptor 1A
Type:
G Protein-Coupled Receptor (GPCR)
Mol. Mass.:
46445.29
Organism:
Rattus norvegicus (rat)
Description:
Binding assays were performed using rat hippocampal membranes.
Residue:
422
  
Inhibitor
Name:
BDBM50118328
Synonyms:
1-Benzo[b]thiophen-3-yl-3-[4-(1H-indol-4-yl)-piperazin-1-yl]-propan-1-ol; | CHEMBL133476
Type:
Small organic molecule
Emp. Form.:
C23H25N3OS
Mol. Mass.:
391.529
SMILES:
OC(CCN1CCN(CC1)c1cccc2[nH]ccc12)c1csc2ccccc12
: