Target
Metabotropic glutamate receptor 2
Ligand
BDBM50052553
Substrate
Meas. Tech.
ChEMBL_106063 (CHEMBL718228)
EC50
35000±n/a nM
Citation
 Clausen, RPBräuner-Osborne, HGreenwood, JRHermit, MBStensbøl, TBNielsen, BKrogsgaard-Larsen, P Selective agonists at group II metabotropic glutamate receptors: synthesis, stereochemistry, and molecular pharmacology of (S)- and (R)-2-amino-4-(4-hydroxy[1,2,5]thiadiazol-3-yl)butyric acid. J Med Chem 45:4240-5 (2002)  
Target
Name:
Metabotropic glutamate receptor 2
Synonyms:
GPRC1B GRM2_HUMAN Metabotropic glutamate receptor mGlu2 | metabotropic glutamate 2
Type:
Enzyme
Mol. Mass.:
95584.88
Organism:
Homo sapiens (Human)
Description:
Q14416
Residue:
872
  
Inhibitor
Name:
BDBM50052553
Synonyms:
(2S)-2-aminohexanedioic acid CHEMBL88804 | L-2-aminoadipic acid
Type:
Small organic molecule
Emp. Form.:
C6H11NO4
Mol. Mass.:
161.1558
SMILES:
N[C@@H](CCCC(O)=O)C(O)=O
: