Target
Receptor-type tyrosine-protein phosphatase F
Ligand
BDBM50118778
Substrate
Meas. Tech.
ChEMBL_162594 (CHEMBL768410)
pH
5.5±n/a
Ki
420000±n/a nM
Comments
extracted
Citation
 Andersen, HSOlsen, OHIversen, LFSørensen, ALMortensen, SBChristensen, MSBranner, SHansen, TKLau, JFJeppesen, LMoran, EJSu, JBakir, FJudge, LShahbaz, MCollins, TVo, TNewman, MJRipka, WCMøller, NP Discovery and SAR of a novel selective and orally bioavailable nonpeptide classical competitive inhibitor class of protein-tyrosine phosphatase 1B. J Med Chem 45:4443-59 (2002)  
Target
Name:
Receptor-type tyrosine-protein phosphatase F
Synonyms:
LAR Leukocyte common antigen related (LAR) PTPRF_HUMAN Receptor-type tyrosine-protein phosphatase F (LAR)
Type:
Protein
Mol. Mass.:
212869.85
Organism:
Homo sapiens (Human)
Description:
P10586
Residue:
1907
  
Inhibitor
Name:
BDBM50118778
Synonyms:
5-iodo-2-(oxaloamino)benzoic acid | CHEMBL336908
Type:
Small organic molecule
Emp. Form.:
C9H6INO5
Mol. Mass.:
335.0521
SMILES:
OC(=O)C(=O)Nc1ccc(I)cc1C(O)=O
: