Target
Estrogen receptor
Ligand
BDBM50118996
Substrate
Meas. Tech.
ChEBML_67839
IC50
7300±n/a nM
Citation
 Smith, RAChen, JMader, MMMuegge, IMoehler, UKatti, SMarrero, DStirtan, WGWeaver, DRXiao, HCarley, W Solid-phase synthesis and investigation of benzofurans as selective estrogen receptor modulators. Bioorg Med Chem Lett 12:2875-8 (2002)  
Target
Name:
Estrogen receptor
Synonyms:
ESR1_RAT Esr1 Nr3a1 | estrogen alpha
Type:
Enzyme Catalytic Domain
Mol. Mass.:
67045.89
Organism:
RAT
Description:
estrogen alpha 0 RAT::P06211
Residue:
600
  
Inhibitor
Name:
BDBM50118996
Synonyms:
(6-Hydroxy-3-naphthalen-1-yl-benzofuran-2-yl)-[3-(2-piperidin-1-yl-ethoxy)-phenyl]-methanone | CHEMBL316730
Type:
Small organic molecule
Emp. Form.:
C32H29NO4
Mol. Mass.:
491.577
SMILES:
Oc1ccc2c(c(oc2c1)C(=O)c1cccc(OCCN2CCCCC2)c1)-c1cccc2ccccc12
: