Target
Adenosine receptor A2a
Ligand
BDBM50119167
Substrate
Meas. Tech.
ChEMBL_30140 (CHEMBL640587)
Ki
140±n/a nM
Citation
 Palle, VPElzein, EOGothe, SALi, ZGao, ZMeyer, SBlackburn, BZablocki, JA Structure-affinity relationships of the affinity of 2-pyrazolyl adenosine analogues for the adenosine A2A receptor. Bioorg Med Chem Lett 12:2935-9 (2002)  
Target
Name:
Adenosine receptor A2a
Synonyms:
AA2AR_RAT Adenosine A2 receptor Adenosine Receptors A2a (A2a) Adenosine receptors A2a Rat striatal adenosine A2a receptor
Type:
G Protein-Coupled Receptor (GPCR)
Mol. Mass.:
45015.65
Organism:
Rattus norvegicus (rat)
Description:
Rat A2A receptors expressed in CHO cells.
Residue:
410
  
Inhibitor
Name:
BDBM50119167
Synonyms:
1-[6-Amino-9-((2R,3R,4S,5R)-3,4-dihydroxy-5-hydroxymethyl-tetrahydro-furan-2-yl)-9H-purin-2-yl]-1H-pyrazole-4-carboxylic acid dimethylamide | CHEMBL415118
Type:
Small organic molecule
Emp. Form.:
C16H20N8O5
Mol. Mass.:
404.3806
SMILES:
CN(C)C(=O)c1cnn(c1)-c1nc(N)c2ncn([C@@H]3O[C@H](CO)[C@@H](O)[C@H]3O)c2n1
: