Target
Beta-2 adrenergic receptor
Ligand
BDBM50119202
Substrate
Meas. Tech.
ChEMBL_38618 (CHEMBL650884)
Ki
140±n/a nM
Citation
 Steffan, RJAshwell, MASolvibile, WRMatelan, ELargis, EHan, STillet, JMulvey, R Novel substituted 4-aminomethylpiperidines as potent and selective human beta3-agonists. Part 2: arylethanolaminomethylpiperidines. Bioorg Med Chem Lett 12:2963-7 (2002)  
Target
Name:
Beta-2 adrenergic receptor
Synonyms:
ADRB2 ADRB2_HUMAN Beta-2 adrenoceptor | Beta-2 adrenoreceptor
Type:
Mol. Mass.:
46461.69
Organism:
Homo sapiens (Human)
Description:
P07550
Residue:
413
  
Inhibitor
Name:
BDBM50119202
Synonyms:
CHEMBL99599 | Nonanoic acid [4-(4-{[2-hydroxy-2-(4-hydroxy-3-methanesulfonylamino-phenyl)-ethylamino]-methyl}-piperidine-1-sulfonyl)-phenyl]-amide
Type:
Small organic molecule
Emp. Form.:
C30H46N4O7S2
Mol. Mass.:
638.839
SMILES:
CCCCCCCCC(=O)Nc1ccc(cc1)S(=O)(=O)N1CCC(CNC[C@H](O)c2ccc(O)c(NS(C)(=O)=O)c2)CC1
: