Target
C-C chemokine receptor type 5
Ligand
BDBM50119320
Substrate
Meas. Tech.
ChEMBL_39512 (CHEMBL654809)
IC50
10±n/a nM
Citation
 Hale, JJBudhu, RJMills, SGMacCoss, MGould, SLDeMartino, JASpringer, MSSiciliano, SJMalkowitz, LSchleif, WAHazuda, DMiller, MKessler, JDanzeisen, RHolmes, KLineberger, JCarella, ACarver, GEmini, EA 1,3,4-Trisubstituted pyrrolidine CCR5 receptor antagonists. Part 3: polar functionality and its effect on anti-HIV-1 activity. Bioorg Med Chem Lett 12:2997-3000 (2002)  
Target
Name:
C-C chemokine receptor type 5
Synonyms:
C-C CKR-5 CC-CKR-5 CCR5 CCR5_HUMAN CHEMR13 HIV-1 fusion coreceptor
Type:
Enzyme
Mol. Mass.:
40540.21
Organism:
Homo sapiens (Human)
Description:
P51681
Residue:
352
  
Inhibitor
Name:
BDBM50119320
Synonyms:
4-(3-(1-(((3S,4S)-1-(cyclohexylmethyl)-4-phenylpyrrolidin-3-yl)methyl)-4-hydroxypiperidin-4-yl)propyl)benzoic acid CHEMBL319689
Type:
Small organic molecule
Emp. Form.:
C33H46N2O3
Mol. Mass.:
518.7299
SMILES:
OC(=O)c1ccc(CCCC2(O)CCN(C[C@H]3CN(CC4CCCCC4)C[C@@H]3c3ccccc3)CC2)cc1
: