Target
Dihydroorotate dehydrogenase (quinone), mitochondrial
Ligand
BDBM50119482
Substrate
Meas. Tech.
ChEMBL_52885 (CHEMBL665409)
Ki
1500±n/a nM
Citation
 Haque, TSTadesse, SMarcinkeviciene, JRogers, MJSizemore, CKopcho, LMAmsler, KEcret, LDZhan, DLHobbs, FSlee, ATrainor, GLStern, AMCopeland, RACombs, AP Parallel synthesis of potent, pyrazole-based inhibitors of Helicobacter pylori dihydroorotate dehydrogenase. J Med Chem 45:4669-78 (2002)  
Target
Name:
Dihydroorotate dehydrogenase (quinone), mitochondrial
Synonyms:
DHODH Dihydroorotate dehydrogenase Dihydroorotate dehydrogenase, mitochondrial Dihydroorotate oxidase (DHODH) | PYRD_HUMAN
Type:
Enzyme
Mol. Mass.:
42881.33
Organism:
Homo sapiens (Human)
Description:
Q02127
Residue:
395
  
Inhibitor
Name:
BDBM50119482
Synonyms:
1-(4-Methoxy-phenyl)-1H-pyrazole-3,5-dicarboxylic acid 5-benzylamide 3-{[4-(pyrrolidine-1-carbonyl)-phenyl]-amide} | CHEMBL141338
Type:
Small organic molecule
Emp. Form.:
C30H29N5O4
Mol. Mass.:
523.5824
SMILES:
COc1ccc(cc1)-n1nc(cc1C(=O)NCc1ccccc1)C(=O)Nc1ccc(cc1)C(=O)N1CCCC1
: