Target
Type-1 angiotensin II receptor
Ligand
BDBM50119658
Substrate
Meas. Tech.
ChEMBL_36921 (CHEMBL876759)
Ki
80±n/a nM
Citation
 Le Bourdonnec, BCauvin, CMeulon, EYous, SGoossens, JFDurant, FHoussin, RHénichart, JP Comparison of 3D structures and AT(1) binding properties of pyrazolidine-3,5-diones and tetrahydropyridazine-3,6-diones with parent antihypertensive drug irbesartan. J Med Chem 45:4794-8 (2002)  
Target
Name:
Type-1 angiotensin II receptor
Synonyms:
AGTR1 AGTR1B AT1 AT1BR AT2R1B Angiotensin II receptor Type-1 angiotensin II receptor (AT1)
Type:
Protein
Mol. Mass.:
41080.75
Organism:
Homo sapiens (Human)
Description:
P30556
Residue:
359
  
Inhibitor
Name:
BDBM50119658
Synonyms:
7-Butyl-8-[2'-(1H-tetrazol-5-yl)-biphenyl-4-ylmethyl]-7,8-diaza-spiro[4.5]decane-6,9-dione CHEMBL146275
Type:
Small organic molecule
Emp. Form.:
C26H30N6O2
Mol. Mass.:
458.5554
SMILES:
CCCCN1N(Cc2ccc(cc2)-c2ccccc2-c2nnn[nH]2)C(=O)CC2(CCCC2)C1=O
: