Target
Adenylate cyclase type 5
Ligand
BDBM50119858
Substrate
Meas. Tech.
ChEMBL_213256 (CHEMBL821464)
IC50
10800±n/a nM
Citation
 Levy, DBao, MTomlinson, JScarborough, R Hydroxamate based inhibitors of adenylyl cyclase. Part 2: the effect of cyclic linkers on P-site binding. Bioorg Med Chem Lett 12:3089-92 (2002)  
Target
Name:
Adenylate cyclase type 5
Synonyms:
ADCY5 Adenylate cyclase | Adenylate cyclase type V
Type:
PROTEIN
Mol. Mass.:
138919.21
Organism:
Homo sapiens (Human)
Description:
ChEMBL_31732
Residue:
1261
  
Inhibitor
Name:
BDBM50119858
Synonyms:
2-[(S)-3-((S)-6-Amino-purin-9-yl)-cyclopentyloxy]-N-hydroxy-acetamide | CHEMBL322646
Type:
Small organic molecule
Emp. Form.:
C12H16N6O3
Mol. Mass.:
292.2938
SMILES:
Nc1ncnc2n(cnc12)[C@@H]1CC[C@@H](C1)OCC(=O)NO
: