Target
Adenosine receptor A1
Ligand
BDBM50120221
Substrate
Meas. Tech.
ChEMBL_29727 (CHEMBL646660)
Kd
0.530±n/a nM
Citation
 Beauglehole, ARBaker, SPScammells, PJ New irreversible adenosine A(1) antagonists based on FSCPX. Bioorg Med Chem Lett 12:3179-82 (2002)  
Target
Name:
Adenosine receptor A1
Synonyms:
A1 adenosine receptor (hA1) AA1R_HUMAN ADORA1 Adenosine A1-receptor Adenosine receptor A1 (hA1) | Adenosine transporter (AdT)
Type:
G Protein-Coupled Receptor (GPCR)
Mol. Mass.:
36520.92
Organism:
Homo sapiens (Human)
Description:
P30542
Residue:
326
  
Inhibitor
Name:
BDBM50120221
Synonyms:
4-[5-(8-Bicyclo[2.2.1]hept-2-yl-2,6-dioxo-1-propyl-1,2,6,7-tetrahydro-purin-3-yl)-pentanoyl]-benzenesulfonyl fluoride | CHEMBL107646
Type:
Small organic molecule
Emp. Form.:
C26H31FN4O5S
Mol. Mass.:
530.612
SMILES:
CCCn1c(=O)n(CCCCC(=O)c2ccc(cc2)S(F)(=O)=O)c2nc([nH]c2c1=O)C1CC2CCC1C2
: